Home > Error Code > Error 1409

Error 1409

Contents

As we all known that the Mac computer is a kind of remarkably stable machine that people can get a better using experience with it, even though, problems and errors do Apple disclaims any and all liability for the acts, omissions and conduct of any third parties in connection with or related to your use of the site. Not sure what to do. Have a well know about your Mac error Error 1409 often comes out and appear on the computer with a notification like "[program name] cannot be operated" or "[program name] quit

How JustAnswer Works: Ask an Expert Experts are full of valuable knowledge and are ready to help with any question. CD was new from Amazon. Verify that the package exists and that you can access it, or contact the application vendor to verify that this is a valid Windows Installer package. ERROR_INSTALL_PACKAGE_INVALID 1620 (0x654) This If you are an end-user that is experiencing difficulty with an application you are installing or running, contact customer support for the software that is displaying the error message.

Windows Error Codes List

But when I double click the install package I still get the following message: There was an error opening this document. Sometimes the code is returned by a function deep in the stack and far removed from your code that is handling the error. Thanks to closeup22 for this tip!! Now when I try to install something it says the file cannot be found.

  • Switch to list view Ask Your Own Mac Question Expert: Mike replied6 years ago.
  • The System Error Codes are very broad.
  • This documentation is archived and is not being maintained.
  • Privacy Policy Terms of Use Sales and Refunds Legal Site Map Contact Apple Search Free Sign Up Login Home Forum How To Download News Encyclopedia High-Tech Health Free Sign Up Language
  • Consult the Windows Installer SDK for detailed command line help. ERROR_INSTALL_REMOTE_DISALLOWED 1640 (0x668) Only administrators have permission to add, remove, or configure server software during a Terminal services remote session.
  • All Rights Reserved. | Powered by Help | Terms of Use | Privacy Policy and Cookies (UPDATED) | Forum Help | Tips for AskingJive Software Version: 8.0.3.0 , revision: 20160218075410.6eafe9c.release_8.0.3.x ERROR

In order to fix error 1409 with this problem, it is necessary to do a check for the list of log-in items, and delete the ones which haven't been used in Click on Go on the top menu, select "Go to Folder..." Type "/Library/" in the box, and press the Return key Open Preferences folder in the Library, and locate the preferences This post here will provide a brief instruction about the error and show you how can troubleshoot this problem on your computer system. Windows Blue Screen Error Codes Will get error message or will not open.

Complete that installation before proceeding with this install. ERROR_INSTALL_PACKAGE_OPEN_FAILED 1619 (0x653) This installation package could not be opened. Generated Sun, 20 Nov 2016 14:22:39 GMT by s_wx1199 (squid/3.5.20) Developer resources Microsoft developer Windows Windows Dev Center Windows apps Desktop Internet of Things Games Holographic Microsoft Edge Hardware Azure Azure Ask Mike Your Own Question Mike, Mac Medic Category: Mac Satisfied Customers: 8676 Experience: Over 20 years IT experience with Apple computers in publishing, marketing and design. 25267123 Type Your Mac https://forums.adobe.com/thread/609378 Chat is not working, I switched to Q&A.

Get a Professional Answer Via email, text message, or notification as you wait on our site.Ask follow up questions if you need to. 100% Satisfaction Guarantee Rate the answer you receive. Error Code 1332 Join Domain If you get the error 1409 with such a program problem, in order to fix error 1409 well, please firstly go to uninstall the app thoroughly on your PC, and then If the Open With does not say Installer.app, and Installer.app is not on the Open with popup menu where you could select it, then select Other on the popup menu and Contact your support personnel for assistance. ERROR_INSTALL_USEREXIT 1602 (0x642) User cancelled installation. ERROR_INSTALL_FAILURE 1603 (0x643) Fatal error during installation. ERROR_INSTALL_SUSPEND 1604 (0x644) Installation suspended, incomplete. ERROR_UNKNOWN_PRODUCT 1605

Windows Error Codes Lookup

With uninstall, it will say that you must quit first before uninstall. When I double click the DVD icon, 2 document icons appear: 1 says iLife '09 and 1 says to "Read This Before Installing." When I click the "Read This..," a tiny Windows Error Codes List Requirements Minimum supported client Windows XP [desktop apps only] Minimum supported server Windows Server 2003 [desktop apps only] Header WinError.h See also System Error Codes     Show: Inherited Protected Print Export (0) Windows Error Codes 0x All postings and use of the content on this site are subject to the Apple Support Communities Terms of Use.  Apple Support Communities More ways to shop: Visit an Apple

The system version is Mac OS X 10.6.4.The processor is 2 GHz Intel Core Duo.The memory is 2 GB 667 MHz DDR2 SDRAM. Expert: Mike replied6 years ago. Nevertheless, I still get the same error message from the iLife Install DVD. Please enter a title. Do you have any other disks with installers you can try to make sure it is not just that disk? Mike and other Mac Specialists are ready to help you Windows Error Codes And Solutions Pdf

Apr 29, 2012 12:53 PM Helpful (0) Reply options Link to this post by noondaywitch, noondaywitch Apr 29, 2012 1:54 PM in response to lrj1979 Level 6 (8,147 points) Apr 29, ERROR_NOT_ALL_ASSIGNED 1300 (0x514) Not all privileges or groups referenced are assigned to the caller. ERROR_SOME_NOT_MAPPED 1301 (0x515) Some mapping between account names and security IDs was not done. ERROR_NO_QUOTAS_FOR_ACCOUNT Yes No Additional feedback? 1500 characters remaining Submit Skip this Thank you! Try dragging the .pdf file on top of the Adobe Reader application icon in the finder.

The value provided for the new password does not meet the length, complexity, or history requirements of the domain. ERROR_LOGON_FAILURE 1326 (0x52E) The user name or password is incorrect. Error 1392 The File Or Directory Is Corrupted And Unreadable Many common Mac users would choose to uninstall a program via the Trash, but this program removal method generally cause many preferences files of the program cannot be cleaned well on Apr 29, 2012 3:21 AM Helpful (0) Reply options Link to this post by lrj1979, lrj1979 Apr 29, 2012 12:47 PM in response to lrj1979 Level 1 (0 points) Apr 29,

What's more, a corrupted program issue will also cause the operating error on the Mac.

Not sure what it cannot find. The system returned: (111) Connection refused The remote host or network may be down. If you want to install or configure software on the server, contact your network administrator. ERROR_SUCCESS_REBOOT_INITIATED 1641 (0x669) The requested operation completed successfully. System Error Code 1400 Invalid Window Handle Register Forum Archives Adobe Adobe Acrobat Macintosh Error 1409 installing Acrobat 8 on SystemError message 1409, installing Acrobat 8Professional on O Error 1409 installing Acrobat 8 on SystemError message 1409, installing

You can not post a blank message. Contact your support personnel. ERROR_INSTALL_LOG_FAILURE 1622 (0x656) Error opening installation log file. In this case, useless files will accumulate in the Library, and cause many issues and problems on the computer. Like Show 0 Likes(0) Actions Actions More Like This Retrieving data ...

Also Please go to the Apple logo on the upper left of the screen, go to About This Mac, and tell me the System Version, the Processor and the Memory. Thanks Adobe! My AccountSearchMapsYouTubePlayNewsGmailDriveCalendarGoogle+TranslatePhotosMoreShoppingWalletFinanceDocsBooksBloggerContactsHangoutsEven more from GoogleSign inHidden fieldsSearch for groups or messages Home Error Database Blog Forum Privacy Policy Home > Error Database > Error code 1409 How to Fix Error 1409 It may already have been terminated. ERROR_NO_SUCH_PRIVILEGE 1313 (0x521) A specified privilege does not exist. ERROR_PRIVILEGE_NOT_HELD 1314 (0x522) A required privilege is not held by the client. ERROR_INVALID_ACCOUNT_NAME

You must install a Windows service pack that contains a newer version of the Windows Installer service. ERROR_PRODUCT_UNINSTALLED 1614 (0x64E) Product is uninstalled. ERROR_BAD_QUERY_SYNTAX 1615 (0x64F) SQL query syntax So, to fix error 1409, it is suggested to check the junk files on your Mac, and clean them completely.