Home > Error Code > Error 1626

Error 1626

Contents

Microsoft documentation is "the request is not supported". 100 File is missing 101 Record is missing 102 Field is missing 103 Relationship is missing 104 Script is missing 105 Layout is ERROR_INVALID_FIELD1616The record field does not exist. Any pending input will be lost. Contact your support personnel.

Prices are exclusive of VAT and are subject to change without notice. ERROR_INSTALL_PACKAGE_REJECTED1625This installation is forbidden by system policy. Go to the “driver” tab and press on “uninstall” button to uninstall the device driver completely. The windows error code 1626 is nearly always caused by driver problems and sometime due to you can bypass the error temporarily such as removing the device from the motherboard and

Msi Error Code 1638

Message: %s Error: 1627 SQLSTATE: HY000 (ER_EXCEPTIONS_WRITE_ERROR) Message: Write to exceptions table failed. Log In | Sign Up Please log in to continue, Username (case sensitive) Password (case sensitive) Forgot your username or password? This message is indicative of a success.

  • ERROR_UNSUPPORTED_TYPE1630Data of this type is not supported.
  • Send feedback.
  • Download Spyware Remover - scans and removes all spyware, adware or viruses on your system.

ERROR_INSTALL_ALREADY_RUNNING1618Another installation is already in progress. Sign in to comment Contact GitHub API Training Shop Blog About © 2016 GitHub, Inc. Available beginning with Windows Installer version 3.0. Windows Installer Error 1619 Click Open or Run this program from its current location.

Available beginning with Windows Installer version 3.0. Msi Error Code 1603 ERROR_FUNCTION_NOT_CALLED1626The function could not be executed. The page will refresh upon submission. Mr White reviews the impact Arminian ideas had in England, firstly through a detailed exposition of the theology of Arminius, and subsequently by means of a review of the links between

Clean Registry Error This software will help to clean registry error. Psexec Error Code 1619 ERROR_APPHELP_BLOCK1259If Windows Installer determines a product may be incompatible with the current operating system, it displays a dialog box informing the user and asking whether to try to install anyway. ERROR_FUNCTION_FAILED1627The function failed during execution. It is returned by the Windows installer function MsiExec.exe and InstMsi.exe.

Msi Error Code 1603

Error: 1625 SQLSTATE: HY000 (ER_NDB_REPLICATION_SCHEMA_ERROR) Message: Bad schema for mysql.ndb_replication table. How to Fix Windows Error Code 1626 Windows error code 1626 can be shortened in only two words: driver problem. Msi Error Code 1638 ERROR_INVALID_PATCH_XML1650The XML patch data is invalid. Windows Installer Error Codes It is unknown device code.

The windows error code 1626 is generally generated due to errors reported by the driver itself meaning that this error is a software problem or compatibility issues between the hardware installed Developer resources Microsoft developer Windows Windows Dev Center Windows apps Desktop Internet of Things Games Holographic Microsoft Edge Hardware Azure Azure Web apps Mobile apps API apps Service fabric Visual Studio Do you want to continue? (new to FileMaker Pro 14, removed in FileMaker Pro 15) 3320 Warning: SSL certificate could not be verified. Message: %s" Error: 1628 SQLSTATE: HY000 (ER_TOO_LONG_TABLE_COMMENT) Message: Comment for table '%s' is too long (max = %lu) Error: 1629 SQLSTATE: HY000 (ER_TOO_LONG_FIELD_COMMENT) Message: Comment for field '%s' is too long Msi Motherboard Error Codes

Do you want to delete the reference to the file anyway? 852 Can not write file to the external storage. 853 One or more containers failed to transfer 900 General spelling Whole scan your PC with good antivirus software. You must install a Windows service pack that contains a newer version of the Windows Installer service. ERROR_PATCH_NO_SEQUENCE1648No valid sequence could be found for the set of patches.

Records could not be imported 730 Unsupported Excel version. (Convert file to Excel 7.0 (Excel 95), Excel 97, 2000, or XP format and try again) 731 The file you are importing Msi Error 1619 Windows 7 The function returns the value ERROR_CALL_NOT_IMPLEMENTED. Digital document tools are available from gDoc Inspired My AccountSearchMapsYouTubePlayNewsGmailDriveCalendarGoogle+TranslatePhotosMoreShoppingWalletFinanceDocsBooksBloggerContactsHangoutsEven more from GoogleSign inHidden fieldsBooksbooks.google.com - This is a major study of the theology of grace in the English Church between

Not all records were imported 727 There are more records in the target table than in the import file.

ERROR_PRODUCT_VERSION1638Another version of this product is already installed. ERROR_INSTALL_SERVICE_FAILURE1601The Windows Installer service could not be accessed. ERROR_INSTALL_PLATFORM_UNSUPPORTED1633This installation package is not supported on this platform. Windows Installer Returned 1613 Vmware ERROR_INSTALL_SUSPEND1604Installation suspended, incomplete.

This does not include installs where the ForceReboot action is run.       Show: Inherited Protected Print Export (0) Print Export (0) Share IN THIS ARTICLE Is this page helpful? Verify that the specified transform paths are valid. ERROR_PRODUCT_UNINSTALLED1614The product is uninstalled. This error code is returned if the user chooses not to try the installation.

e.g. Use SET %s to assign the value Error: 1622 SQLSTATE: HY000 (ER_WARN_ENGINE_TRANSACTION_ROLLBACK) Message: Storage engine %s does not support rollback for this statement. Verify that the program to be upgraded exists on your computer and that you have the correct upgrade patch. ERROR_INSTALL_REJECTED1654The app that you are trying to run is not supported on this version of Windows.

ERROR_INSTALL_TRANSFORM_FAILURE1624There was an error applying transforms. And click Enter.