Home > Windows Installer > Error 1619 During Installation

Error 1619 During Installation

Contents

ERROR_UNKNOWN_PROPERTY1608This is an unknown property. Thank you Forum Moderator Last edited by GeorgeV; January 29th, 2014 at 09:39 AM. ERROR_INSTALL_NOTUSED1634Component is not used on this machine. Make sure it has a "check" mark next to Windows Installer.

Contact your support personnel to verify that the Windows Installer service is properly registered. Mostrar más Cargando... Información Prensa Derechos de autor Creadores Publicidad Desarrolladores +YouTube Términos Privacidad Política y seguridad Enviar sugerencias ¡Prueba algo nuevo! A Windows Installer package, patch, or transform that has not been signed by Microsoft cannot be installed on an ARM computer.

Windows Installer Error 1619

Verify that the package exists and that you can access it, or contact the application vendor to verify that this is a valid Windows Installer package." This indicates that the exe All rights reserved. New - Anti-Phishing Protection for Chrome. Please uninstall the prerequisite program causing the issue and run your installer again.For more information about this process, please see my KB link here:http://forums.autodesk.com/t5/Installation-Licensing/Some-Products-Fail-to-Install-Result-1603/td-p/3382347If the prerequisite is not already installed and

See the answer in context. 1 Kudo Install .NET Framework Runtime 3.5 SP1 Failed Installation aborted, Result=1603 Your product is failing to install because the prerequiste program required by the installer What happens if you manually run the setup? Deshacer Cerrar Este vídeo no está disponible. Msi Error 1619 Windows 7 This is most common with the Microsoft firewall actually.

Cola de reproducciónColaCola de reproducciónCola Eliminar todoDesconectar The next video is startingstop Cargando... Please uninstall the prerequisite program causing the issue and run your installer again.For more information about this process, please see my KB link here:http://forums.autodesk.com/t5/Installation-Licensing/Some-Products-Fail-to-Install-Result-1603/td-p/...If the prerequisite is not already installed and It used to work, but the only option I see for fixing Explorer shutting down is to reformat my drive. Anthony on Thu, 15th Mar 2012 8:55 pm @George Lea Take ownership of your entire C:, I mean all your System Folders - Windows, Program Data, Documents and Settings etc etc.

Here is how to collect logs. Msi Motherboard Error Codes Verify that the package exists and is accessible, or contact the application vendor to verify that this is a valid Windows Installer package. 0 Comments [ + ] Show Comments Make sure you are an admin. Main Sections Technology News Reviews Features Product Finder Downloads Drivers Community TechSpot Forums Today's Posts Ask a Question News & Comments Useful Resources Best of the Best Must Reads Trending Now

Psexec Error Code 1619

Developer resources Microsoft developer Windows Windows Dev Center Windows apps Desktop Internet of Things Games Holographic Microsoft Edge Hardware Azure Azure Web apps Mobile apps API apps Service fabric Visual Studio

Don't have a SymAccount? Windows Installer Error 1619 Yes, my password is: Forgot your password? Msi Error Code 1603 Please make sure you manually install the prerequisite file from Microsoft and then modify the setup.ini file accordingly.For more information on this process, please see my KB article here:http://forums.autodesk.com/t5/Installation-Licensing/Install-NET-Framework-Language-Pack-Failed-Inst...

SFHscarface 16.725 visualizaciones 1:51 How to fix skype error 1603 while installing & Uninstall - Duración: 4:07. some products failed to install - Duración: 1:24. ERROR_INSTALL_TRANSFORM_FAILURE1624There was an error applying transforms. Answered 05/30/2007 by: williamp Please log in to comment Please log in to comment 1 Another thing that can cause this error 1619 is if you try to install the package Windows Installer Error Codes

Hello Henrik, Thanks for the quick response. Legal | Feedback 8971ac5 Tue November 1 16:43:30 EDT 2016"www.itninja.com Ownership of the file can also be important, although I don't see how you would not have ownership of a file that is residing in your User-folder. I had tried to use the software after the installer just to see if the error was bogus, but, there were 2 issues I noticed, so, it didn't install right.

The correct reference to this file in the command line should be "subfolder\msi filename.msi".Do not begin the reference with ".\".This will cause the 1619 error.The full command line should be in Windows Installer Returned 1613 Vmware Click Start > All Programs > Check Point > ZoneAlarm > ZoneAlarm Diagnostics Tool When the Diagnostics tool open click the Collect Data button. Contact your support personnel.

ERROR_INSTALL_SUSPEND1604Installation suspended, incomplete.

  1. I am trying to deploy a simple .exe package from SCCM 2007 to two test computers.
  2. Install Google Video Chat Plugin.
  3. This message is indicative of a success.
  4. Done!
  5. Contact your system administrator.
  6. Create a SymAccount now!' Windows Installer Error 1619 using Software Delivery with a package that contains sub-folders TECH19553 May 12th, 2008 http://www.symantec.com/docs/TECH19553 Support / Windows Installer Error 1619 using Software Delivery

Answers 1 Often this error is seen as a result of insufficient access to the installation folder. Join thousands of tech enthusiasts and participate. Facebook Google+ Twitter YouTube Subscribe to TechSpot RSS Get our weekly newsletter Search TechSpot Trending Hardware The Web Culture Mobile Gaming Apple Microsoft Google Reviews Graphics Laptops Smartphones CPUs Storage Cases Windows Installer Returned 1639 I don't know exactly what fixed it but it is related to Permissions and Ownerships that are messed up in Windows 7.

Windows 10, Windows 8.1, Windows 7 SP1, and Vista SP2 English, French, Italian, German and Spanish. Acción en curso... If you choose to participate, the online survey will be presented to you when you leave the Technet Web site.Would you like to participate? ERROR_PATCH_PACKAGE_OPEN_FAILED1635This patch package could not be opened.

Submit a False Positive Report a suspected erroneous detection (false positive). Dephez 18.100 visualizaciones 5:45 Cargando más sugerencias... ERROR_INSTALL_LOG_FAILURE1622There was an error opening installation log file. Ask the community.

I'm running Windows 7 64 bit Home Premium SP 1. Answered 11/25/2013 by: Utnapishtim Please log in to comment Please log in to comment Answer this question or Comment on this question for clarity AnswerSubmit Don't be a Stranger! Añadir a ¿Quieres volver a verlo más tarde? Contact your application vendor.

If I still get a 1619 error, I'll send the logs as requested. ERROR_INVALID_TABLE1628An invalid or unknown table was specified. Close Login Didn't find the article you were looking for?